Target
Beta-secretase 2
Ligand
BDBM256806
Substrate
Meas. Tech.
Time-Resolved Endpoint proteolysis Assay
pH
5±n/a
Temperature
303.15±n/a K
Ki
3±n/a nM
Comments
extracted
Citation
 Cumming, JNKaelin, Jr., DEScott, JDStamford, AWIserloh, U C6-azaspiro iminothiadiazine dioxides as bace inhibitors, compositions, and their use US Patent  US9489013 Publication Date 11/8/2016 
Target
Name:
Beta-secretase 2
Synonyms:
AEPLC ASP1 Asp 1 Aspartyl protease 1 BACE2_HUMAN Beta-secretase (BACE) Beta-secretase 2 (BACE-2) Beta-site APP-cleaving enzyme 2 Memapsin-1 beta-Secretase (BACE-2)
Type:
Protein
Mol. Mass.:
56171.20
Organism:
Homo sapiens (Human)
Description:
Q9Y5Z0
Residue:
518
  
Inhibitor
Name:
BDBM256806
Synonyms:
US9489013, 77
Type:
Small organic molecule
Emp. Form.:
C24H30F2N6O5S2
Mol. Mass.:
584.659
SMILES:
CC(C)CS(=O)(=O)N1CC[C@@]2(C1)[C@](C)(NC(=N)N(C)S2(=O)=O)c1cc(NC(=O)c2ccc(F)cn2)ccc1F
: