Target
Interleukin-1 receptor-associated kinase 4
Ligand
BDBM294326
Substrate
Meas. Tech.
IMAP Technology
pH
7.2±n/a
IC50
3616±n/a nM
Comments
extracted
Citation
 Seganish, WMHanisak, JLi, GZhang, RTang, H Inhibitors of IRAK4 activity US Patent  US9586948 Publication Date 3/7/2017 
Target
Name:
Interleukin-1 receptor-associated kinase 4
Synonyms:
IRAK-4 IRAK4_HUMAN Interleukin-1 receptor-associated kinase 4 (IRAK4) | Renal carcinoma antigen NY-REN-64
Type:
Protein
Mol. Mass.:
51519.08
Organism:
Homo sapiens (Human)
Description:
Q9NWZ3
Residue:
460
  
Inhibitor
Name:
BDBM294326
Synonyms:
US9586948, Example 45
Type:
Small organic molecule
Emp. Form.:
C25H29N7O4S
Mol. Mass.:
523.607
SMILES:
Cn1cc(NC(=O)c2cccc(n2)-c2ccnc(NCC3CC3)c2)c(n1)C(=O)NCC1CCS(=O)(=O)C1
: