Target
Ectonucleotide pyrophosphatase/phosphodiesterase family member 2
Ligand
BDBM258585
Substrate
Meas. Tech.
Enzyme Inhibition Assay
pH
8±n/a
Temperature
303.15±n/a K
IC50
1±n/a nM
Comments
extracted
Citation
 Hunziker, DMattei, PMauser, HPrunotto, MUllmer, C Diazaspirocycloalkane and azaspirocycloalkane US Patent  US9493486 Publication Date 11/15/2016 
Target
Name:
Ectonucleotide pyrophosphatase/phosphodiesterase family member 2
Synonyms:
ATX Autotaxin (ATX) ENPP2 Ectonucleotide Pyrophosphatase/Phosphodiesterase 2 (ENPP2) Extracellular lysophospholipase D PDNP2
Type:
Enzyme
Mol. Mass.:
99007.13
Organism:
Homo sapiens (Human)
Description:
Q13822
Residue:
863
  
Inhibitor
Name:
BDBM258585
Synonyms:
US10633384, 13.01 | US9493486, 13.01
Type:
Small organic molecule
Emp. Form.:
C22H24F4N6O4
Mol. Mass.:
512.4574
SMILES:
Fc1cc(OC(F)(F)F)ccc1COC(=O)N1CCC2(CN(C2)C(=O)N2CCc3[nH]nnc3C2)CC1
: