Target
Poly [ADP-ribose] polymerase tankyrase-1 [1091-1325]
Ligand
BDBM259596
Substrate
Meas. Tech.
Biochemical Assay
IC50
0.206±n/a nM
Citation
 Bregman, HBuchanan, JLChakka, NDimauro, EFGunaydin, HGuzman-Perez, AHua, ZHuang, X Quinazolinone compounds and derivatives thereof US Patent  US9505749 Publication Date 11/29/2016 
Target
Name:
Poly [ADP-ribose] polymerase tankyrase-1 [1091-1325]
Synonyms:
PARP5A TIN1 TNKS TNKS1_HUMAN | Tankyrase-1
Type:
Enzyme
Mol. Mass.:
26714.90
Organism:
Homo sapiens (Human)
Description:
O95271[1091-1325]
Residue:
235
  
Inhibitor
Name:
BDBM259596
Synonyms:
US9505749, 109
Type:
Small organic molecule
Emp. Form.:
C24H24N4O3S
Mol. Mass.:
448.537
SMILES:
O=C(CCSc1nc2ccccc2c(=O)[nH]1)N[C@H]1CC[C@@H](CC1)Oc1cccc(c1)C#N
: