Target
Poly [ADP-ribose] polymerase tankyrase-2 [946-1162]
Ligand
BDBM259593
Substrate
Meas. Tech.
Biochemical Assay
IC50
0.0982±n/a nM
Citation
 Bregman, HBuchanan, JLChakka, NDimauro, EFGunaydin, HGuzman-Perez, AHua, ZHuang, X Quinazolinone compounds and derivatives thereof US Patent  US9505749 Publication Date 11/29/2016 
Target
Name:
Poly [ADP-ribose] polymerase tankyrase-2 [946-1162]
Synonyms:
PARP5B TNKL TNKS2_HUMAN | Tankyrase-2
Type:
Enzyme
Mol. Mass.:
24581.05
Organism:
Homo sapiens (Human)
Description:
aa 946-1162
Residue:
217
  
Inhibitor
Name:
BDBM259593
Synonyms:
US9505749, 105
Type:
Small organic molecule
Emp. Form.:
C23H24ClN3O3S
Mol. Mass.:
457.973
SMILES:
Clc1ccc(O[C@H]2CC[C@@H](CC2)NC(=O)CCSc2nc3ccccc3c(=O)[nH]2)cc1
: