Target
Hexokinase-4
Ligand
BDBM260394
Substrate
Meas. Tech.
Glucokinase Activity Assay
EC50
49.3±n/a nM
Citation
 Lin, SParmee, ERXu, J 2-pyridinecarboxamide derivatives, compositions containing such compounds, and methods of treatment US Patent  US9527838 Publication Date 12/27/2016 
Target
Name:
Hexokinase-4
Synonyms:
FLAG-Glucokinase (GK)
Type:
Protein
Mol. Mass.:
Description:
Components:
This complex has 2 components.
Component 1
Name:
FLAG-tagged fusion protein
Synonyms:
Type:
Protein
Mol. Mass.:
1009.95
Organism:
Homo sapiens (Human)
Description:
Residue:
8
DYKDDDDK
  
Component 2
Name:
Hexokinase-4
Synonyms:
GCK Glucokinase (GK) HK IV HXK4_HUMAN Hexokinase-D
Type:
Enzyme
Mol. Mass.:
52175.81
Organism:
Homo sapiens (Human)
Description:
P35557
Residue:
465
  
Inhibitor
Name:
BDBM260394
Synonyms:
US9527838, 22
Type:
Small organic molecule
Emp. Form.:
C22H19FN6O3S3
Mol. Mass.:
530.618
SMILES:
CCOC(=O)Cc1csc(NC(=O)c2nc(Sc3nncn3C)ccc2Sc2ccc(F)cc2)n1
: