Target
Interleukin-1 receptor-associated kinase 4
Ligand
BDBM407416
Substrate
Meas. Tech.
IRAK4 Monocyte TNFalpha Cell Based Assay
IC50
1.000±n/a nM
Citation
 Bacon, EMBrizgys, GChin, EChou, CCottell, JJLink, JOTaylor, JGTse, WCWright, NEYang, ZZhang, JRZipfel, SM Pyrrolo[1,2-b]pyridazine derivatives US Patent  US10336762 Publication Date 7/2/2019 
Target
Name:
Interleukin-1 receptor-associated kinase 4
Synonyms:
IRAK-4 IRAK4_HUMAN Interleukin-1 receptor-associated kinase 4 (IRAK4) | Renal carcinoma antigen NY-REN-64
Type:
Protein
Mol. Mass.:
51519.08
Organism:
Homo sapiens (Human)
Description:
Q9NWZ3
Residue:
460
  
Inhibitor
Name:
BDBM407416
Synonyms:
6-(3-cyanopyrrolo[1,2- b]pyridazin-7-yl)-4-((4- hydroxybicyclo[2.2.2] octan-1-yl)amino)-N- (methyl-d3)nicotinamide US10336762, Compound 361
Type:
Small organic molecule
Emp. Form.:
C23H24N6O2
Mol. Mass.:
416.4757
SMILES:
CNC(=O)c1cnc(cc1NC12CCC(O)(CC1)CC2)-c1ccc2cc(cnn12)C#N
: