Target
Interleukin-1 receptor-associated kinase 4
Ligand
BDBM407424
Substrate
Meas. Tech.
IRAK4 Monocyte TNFalpha Cell Based Assay
IC50
1.000±n/a nM
Citation
 Bacon, EMBrizgys, GChin, EChou, CCottell, JJLink, JOTaylor, JGTse, WCWright, NEYang, ZZhang, JRZipfel, SM Pyrrolo[1,2-b]pyridazine derivatives US Patent  US10336762 Publication Date 7/2/2019 
Target
Name:
Interleukin-1 receptor-associated kinase 4
Synonyms:
IRAK-4 IRAK4_HUMAN Interleukin-1 receptor-associated kinase 4 (IRAK4) | Renal carcinoma antigen NY-REN-64
Type:
Protein
Mol. Mass.:
51519.08
Organism:
Homo sapiens (Human)
Description:
Q9NWZ3
Residue:
460
  
Inhibitor
Name:
BDBM407424
Synonyms:
6-(3-cyanopyrrolo[1,2- b]pyridazin-7-yl)-N- ((1r,4S)-4-(dimethylamino) cyclohexyl)-4-(((1S,3R)-3- hydroxycyclohexyl)amino) nicotinamide | US10336762, Compound 366
Type:
Small organic molecule
Emp. Form.:
C28H35N7O2
Mol. Mass.:
501.6232
SMILES:
CN(C)[C@H]1CCC(CC1)NC(=O)c1cnc(cc1N[C@H]1CCC[C@@H](O)C1)-c1ccc2cc(cnn12)C#N
: