Target
Interleukin-1 receptor-associated kinase 4
Ligand
BDBM407443
Substrate
Meas. Tech.
IRAK4 Monocyte TNFalpha Cell Based Assay
IC50
<1.000±n/a nM
Citation
 Bacon, EMBrizgys, GChin, EChou, CCottell, JJLink, JOTaylor, JGTse, WCWright, NEYang, ZZhang, JRZipfel, SM Pyrrolo[1,2-b]pyridazine derivatives US Patent  US10336762 Publication Date 7/2/2019 
Target
Name:
Interleukin-1 receptor-associated kinase 4
Synonyms:
IRAK-4 IRAK4_HUMAN Interleukin-1 receptor-associated kinase 4 (IRAK4) | Renal carcinoma antigen NY-REN-64
Type:
Protein
Mol. Mass.:
51519.08
Organism:
Homo sapiens (Human)
Description:
Q9NWZ3
Residue:
460
  
Inhibitor
Name:
BDBM407443
Synonyms:
(R)-6-(3-cyanopyrrolo[1,2- b]pyridazin-7-yl)-N-(2- fluoro-3-hydroxy-3- methylbutyl)-4-((4-(2- oxopyridin-1(2H)-yl) phenyl)amino)nicotinamide | US10336762, Compound 385
Type:
Small organic molecule
Emp. Form.:
C30H26FN7O3
Mol. Mass.:
551.5709
SMILES:
CC(C)(O)[C@H](F)CNC(=O)c1cnc(cc1Nc1ccc(cc1)-n1ccccc1=O)-c1ccc2cc(cnn12)C#N
: