Target
Interleukin-1 receptor-associated kinase 4
Ligand
BDBM407446
Substrate
Meas. Tech.
IRAK4 Monocyte TNFalpha Cell Based Assay
IC50
1.000±n/a nM
Citation
 Bacon, EMBrizgys, GChin, EChou, CCottell, JJLink, JOTaylor, JGTse, WCWright, NEYang, ZZhang, JRZipfel, SM Pyrrolo[1,2-b]pyridazine derivatives US Patent  US10336762 Publication Date 7/2/2019 
Target
Name:
Interleukin-1 receptor-associated kinase 4
Synonyms:
IRAK-4 IRAK4_HUMAN Interleukin-1 receptor-associated kinase 4 (IRAK4) | Renal carcinoma antigen NY-REN-64
Type:
Protein
Mol. Mass.:
51519.08
Organism:
Homo sapiens (Human)
Description:
Q9NWZ3
Residue:
460
  
Inhibitor
Name:
BDBM407446
Synonyms:
N-(cyanomethyl)-6-(3- cyanopyrrolo[1,2-b] pyridazin-7-yl)-4- (((1s,3s)-3-hydroxy-3- methylcyclobutyl)amino) nicotinamide | US10336762, Compound 388
Type:
Small organic molecule
Emp. Form.:
C21H19N7O2
Mol. Mass.:
401.4213
SMILES:
C[C@@]1(O)C[C@@H](C1)Nc1cc(ncc1C(=O)NCC#N)-c1ccc2cc(cnn12)C#N
: