Target
Interleukin-1 receptor-associated kinase 4
Ligand
BDBM407464
Substrate
Meas. Tech.
IRAK4 Monocyte TNFalpha Cell Based Assay
IC50
1.000±n/a nM
Citation
 Bacon, EMBrizgys, GChin, EChou, CCottell, JJLink, JOTaylor, JGTse, WCWright, NEYang, ZZhang, JRZipfel, SM Pyrrolo[1,2-b]pyridazine derivatives US Patent  US10336762 Publication Date 7/2/2019 
Target
Name:
Interleukin-1 receptor-associated kinase 4
Synonyms:
IRAK-4 IRAK4_HUMAN Interleukin-1 receptor-associated kinase 4 (IRAK4) | Renal carcinoma antigen NY-REN-64
Type:
Protein
Mol. Mass.:
51519.08
Organism:
Homo sapiens (Human)
Description:
Q9NWZ3
Residue:
460
  
Inhibitor
Name:
BDBM407464
Synonyms:
(R)-6-(3-cyanopyrrolo[1,2- b]pyridazin-7-yl)-4-((4- (cyclopropylcarbamoyl) bicyclo[2.2.2]octan-1- yl)amino)-N-(2-fluoro-3- hydroxy-3-methylbutyl) nicotinamide | US10336762, Compound 406
Type:
Small organic molecule
Emp. Form.:
C31H36FN7O3
Mol. Mass.:
573.661
SMILES:
CC(C)(O)[C@H](F)CNC(=O)c1cnc(cc1NC12CCC(CC1)(CC2)C(=O)NC1CC1)-c1ccc2cc(cnn12)C#N
: