Target
Interleukin-1 receptor-associated kinase 4
Ligand
BDBM407875
Substrate
Meas. Tech.
IRAK4 Monocyte TNFalpha Cell Based Assay
IC50
<1.000±n/a nM
Citation
 Bacon, EMBrizgys, GChin, EChou, CCottell, JJLink, JOTaylor, JGTse, WCWright, NEYang, ZZhang, JRZipfel, SM Pyrrolo[1,2-b]pyridazine derivatives US Patent  US10336762 Publication Date 7/2/2019 
Target
Name:
Interleukin-1 receptor-associated kinase 4
Synonyms:
IRAK-4 IRAK4_HUMAN Interleukin-1 receptor-associated kinase 4 (IRAK4) | Renal carcinoma antigen NY-REN-64
Type:
Protein
Mol. Mass.:
51519.08
Organism:
Homo sapiens (Human)
Description:
Q9NWZ3
Residue:
460
  
Inhibitor
Name:
BDBM407875
Synonyms:
US10336762, Compound 819 | methyl (((1r,3r)-3-((5- ((3-amino-3-methylbutyl) carbamoyl)-2-(3-cyano- pyrrolo[1,2-b]pyridazin-7- yl)pyridin-4-yl)amino)cyclo- butyl)methyl)carbamate
Type:
Small organic molecule
Emp. Form.:
C26H32N8O3
Mol. Mass.:
504.5841
SMILES:
COC(=O)NC[C@H]1C[C@@H](C1)Nc1cc(ncc1C(=O)NCCC(C)(C)N)-c1ccc2cc(cnn12)C#N
: