Target
Interleukin-1 receptor-associated kinase 4
Ligand
BDBM407877
Substrate
Meas. Tech.
IRAK4 Monocyte TNFalpha Cell Based Assay
IC50
<1.000±n/a nM
Citation
 Bacon, EMBrizgys, GChin, EChou, CCottell, JJLink, JOTaylor, JGTse, WCWright, NEYang, ZZhang, JRZipfel, SM Pyrrolo[1,2-b]pyridazine derivatives US Patent  US10336762 Publication Date 7/2/2019 
Target
Name:
Interleukin-1 receptor-associated kinase 4
Synonyms:
IRAK-4 IRAK4_HUMAN Interleukin-1 receptor-associated kinase 4 (IRAK4) | Renal carcinoma antigen NY-REN-64
Type:
Protein
Mol. Mass.:
51519.08
Organism:
Homo sapiens (Human)
Description:
Q9NWZ3
Residue:
460
  
Inhibitor
Name:
BDBM407877
Synonyms:
(R)-4-((1,6-naphthyridin- 2-yl)amino)-6-(3-cyano- pyrrolo[1,2-b]pyridazin-7- yl)-N-(2-fluoro-3-hydroxy- 3-methylbutyl)nicotinamide | US10336762, Compound 821
Type:
Small organic molecule
Emp. Form.:
C27H23FN8O2
Mol. Mass.:
510.5223
SMILES:
CC(C)(O)[C@H](F)CNC(=O)c1cnc(cc1Nc1ccc2cnccc2n1)-c1ccc2cc(cnn12)C#N
: