Target
Interleukin-1 receptor-associated kinase 4
Ligand
BDBM407888
Substrate
Meas. Tech.
IRAK4 Monocyte TNFalpha Cell Based Assay
IC50
1.000±n/a nM
Citation
 Bacon, EMBrizgys, GChin, EChou, CCottell, JJLink, JOTaylor, JGTse, WCWright, NEYang, ZZhang, JRZipfel, SM Pyrrolo[1,2-b]pyridazine derivatives US Patent  US10336762 Publication Date 7/2/2019 
Target
Name:
Interleukin-1 receptor-associated kinase 4
Synonyms:
IRAK-4 IRAK4_HUMAN Interleukin-1 receptor-associated kinase 4 (IRAK4) | Renal carcinoma antigen NY-REN-64
Type:
Protein
Mol. Mass.:
51519.08
Organism:
Homo sapiens (Human)
Description:
Q9NWZ3
Residue:
460
  
Inhibitor
Name:
BDBM407888
Synonyms:
6-(3-cyanopyrrolo[1,2-b] pyridazin-7-yl)-N-((R)-2- fluoro-3-hydroxy-3- methylbutyl)-4-(((5R,8r)- 2-oxo-1-azaspiro[4.5] decan-8-yl)amino) nicotinamide | US10336762, Compound 832
Type:
Small organic molecule
Emp. Form.:
C28H32FN7O3
Mol. Mass.:
533.5972
SMILES:
CC(C)(O)[C@H](F)CNC(=O)c1cnc(cc1NC1CCC2(CCC(=O)N2)CC1)-c1ccc2cc(cnn12)C#N
: