Target
Interleukin-1 receptor-associated kinase 4
Ligand
BDBM407889
Substrate
Meas. Tech.
IRAK4 Monocyte TNFalpha Cell Based Assay
IC50
1.000±n/a nM
Citation
 Bacon, EMBrizgys, GChin, EChou, CCottell, JJLink, JOTaylor, JGTse, WCWright, NEYang, ZZhang, JRZipfel, SM Pyrrolo[1,2-b]pyridazine derivatives US Patent  US10336762 Publication Date 7/2/2019 
Target
Name:
Interleukin-1 receptor-associated kinase 4
Synonyms:
IRAK-4 IRAK4_HUMAN Interleukin-1 receptor-associated kinase 4 (IRAK4) | Renal carcinoma antigen NY-REN-64
Type:
Protein
Mol. Mass.:
51519.08
Organism:
Homo sapiens (Human)
Description:
Q9NWZ3
Residue:
460
  
Inhibitor
Name:
BDBM407889
Synonyms:
6-(3-cyanopyrrolo[1,2-b] pyridazin-7-yl)-4-((3- (((R)-2,2-difluorocyclo- propane-1-carboxamido) methyl)bicyclo[1.1.1] pentan-1-yl)amino)-N- ((R)-2-fluoro-3-hydroxy- 3-methylbutyl)nicotinamide | US10336762, Compound 833
Type:
Small organic molecule
Emp. Form.:
C29H30F3N7O3
Mol. Mass.:
581.5888
SMILES:
CC(C)(O)[C@H](F)CNC(=O)c1cnc(cc1NC12CC(CNC(=O)C3CC3(F)F)(C1)C2)-c1ccc2cc(cnn12)C#N
: