Target
Interleukin-1 receptor-associated kinase 4
Ligand
BDBM407890
Substrate
Meas. Tech.
IRAK4 Monocyte TNFalpha Cell Based Assay
IC50
<1.000±n/a nM
Citation
 Bacon, EMBrizgys, GChin, EChou, CCottell, JJLink, JOTaylor, JGTse, WCWright, NEYang, ZZhang, JRZipfel, SM Pyrrolo[1,2-b]pyridazine derivatives US Patent  US10336762 Publication Date 7/2/2019 
Target
Name:
Interleukin-1 receptor-associated kinase 4
Synonyms:
IRAK-4 IRAK4_HUMAN Interleukin-1 receptor-associated kinase 4 (IRAK4) | Renal carcinoma antigen NY-REN-64
Type:
Protein
Mol. Mass.:
51519.08
Organism:
Homo sapiens (Human)
Description:
Q9NWZ3
Residue:
460
  
Inhibitor
Name:
BDBM407890
Synonyms:
(R)-methyl (4-((2-(3-cyano- pyrrolo[1,2-b]pyridazin-7- yl)-5-((2-fluoro-3-hydroxy- 3-methylbutyl)carbamoyl) pyridin-4-yl)amino)-2- fluorobenzyl)carbamate | US10336762, Compound 834
Type:
Small organic molecule
Emp. Form.:
C28H27F2N7O4
Mol. Mass.:
563.5553
SMILES:
COC(=O)NCc1ccc(Nc2cc(ncc2C(=O)NC[C@@H](F)C(C)(C)O)-c2ccc3cc(cnn23)C#N)cc1F
: