Target
Interleukin-1 receptor-associated kinase 4
Ligand
BDBM407896
Substrate
Meas. Tech.
IRAK4 Monocyte TNFalpha Cell Based Assay
IC50
<1.000±n/a nM
Citation
 Bacon, EMBrizgys, GChin, EChou, CCottell, JJLink, JOTaylor, JGTse, WCWright, NEYang, ZZhang, JRZipfel, SM Pyrrolo[1,2-b]pyridazine derivatives US Patent  US10336762 Publication Date 7/2/2019 
Target
Name:
Interleukin-1 receptor-associated kinase 4
Synonyms:
IRAK-4 IRAK4_HUMAN Interleukin-1 receptor-associated kinase 4 (IRAK4) | Renal carcinoma antigen NY-REN-64
Type:
Protein
Mol. Mass.:
51519.08
Organism:
Homo sapiens (Human)
Description:
Q9NWZ3
Residue:
460
  
Inhibitor
Name:
BDBM407896
Synonyms:
(R)-6-(3-cyanopyrrolo[1,2- b]pyridazin-7-yl)-N-(2- fluoro-3-hydroxy-3- methylbutyl)-4-((5- methoxypyrazin-2- yl)amino)nicotinamide | US10336762, Compound 840
Type:
Small organic molecule
Emp. Form.:
C24H23FN8O3
Mol. Mass.:
490.4896
SMILES:
COc1cnc(Nc2cc(ncc2C(=O)NC[C@@H](F)C(C)(C)O)-c2ccc3cc(cnn23)C#N)cn1
: