Target
Protein O-GlcNAcase
Ligand
BDBM408253
Substrate
Meas. Tech.
Human O-GlcNAcase enzyme inhibition assay
IC50
<50±n/a nM
Citation
 Quattropani, AKulkarni, SSGiri, AG Glycosidase inhibitors US Patent  US10336775 Publication Date 7/2/2019 
Target
Name:
Protein O-GlcNAcase
Synonyms:
2-acetamido-2-deoxy-β-D-glucopyranosidase (O-GlcNAcase) Beta-hexosaminidase (O-GlcNAcase) HEXC MEA5 N-acetyl-beta-D-glucosaminidase (O-GlcNAcase) OGA Protein O-GlcNAcase
Type:
Enzyme
Mol. Mass.:
102874.67
Organism:
Homo sapiens (Human)
Description:
O60502
Residue:
916
  
Inhibitor
Name:
BDBM408253
Synonyms:
(S)-N-(2-(4-(1-(benzo[d][1,3]dioxol-5-yl)ethyl)piperazin-1-yl)pyrimidin-5-yl)-3-hydroxypropanamide US11046712, No 177
Type:
Small organic molecule
Emp. Form.:
C20H25N5O4
Mol. Mass.:
399.4436
SMILES:
C[C@H](N1CCN(CC1)c1ncc(NC(=O)CCO)cn1)c1ccc2OCOc2c1
: