Target
Protein O-GlcNAcase
Ligand
BDBM408271
Substrate
Meas. Tech.
Human O-GlcNAcase enzyme inhibition assay
IC50
<50±n/a nM
Citation
 Quattropani, AKulkarni, SSGiri, AG Glycosidase inhibitors US Patent  US10336775 Publication Date 7/2/2019 
Target
Name:
Protein O-GlcNAcase
Synonyms:
2-acetamido-2-deoxy-β-D-glucopyranosidase (O-GlcNAcase) Beta-hexosaminidase (O-GlcNAcase) HEXC MEA5 N-acetyl-beta-D-glucosaminidase (O-GlcNAcase) OGA Protein O-GlcNAcase
Type:
Enzyme
Mol. Mass.:
102874.67
Organism:
Homo sapiens (Human)
Description:
O60502
Residue:
916
  
Inhibitor
Name:
BDBM408271
Synonyms:
(S)-2-(4-(1-(benzo[d][1,3]dioxol-5-yl)ethyl)piperazin-1-yl)-5-methoxypyrimidine US11046712, No 195
Type:
Small organic molecule
Emp. Form.:
C18H22N4O3
Mol. Mass.:
342.3923
SMILES:
COc1cnc(nc1)N1CCN(CC1)[C@@H](C)c1ccc2OCOc2c1
: