Target
Plasma kallikrein
Ligand
BDBM408697
Substrate
Meas. Tech.
Inhibitory Activity In Vitro Assay
IC50
257±n/a nM
Citation
 Davie, RLEdwards, HJEvans, DMHodgson, ST N-((het) arylmethyl)-heteroaryl-carboxamides compounds as plasma kallikrein inhibitors US Patent  US10364238 Publication Date 7/30/2019 
Target
Name:
Plasma kallikrein
Synonyms:
Fletcher factor KLKB1 Kallikrein Plasma kallikrein heavy chain Plasma prekallikrein
Type:
Protein
Mol. Mass.:
71391.16
Organism:
Homo sapiens (Human)
Description:
P03952
Residue:
638
  
Inhibitor
Name:
BDBM408697
Synonyms:
N-{[3-chloro-2-fluoro-6-(trifluoromethyl)phenyl]methyl}-1-({4-[(4-methylpyrazol-1- yl)methyl]phenyl}methyl)-3-(trifluoromethyl)pyrazole-4-carboxamide US11001578, Example 21 US11198691, Example 21
Type:
Small organic molecule
Emp. Form.:
C25H19ClF7N5O
Mol. Mass.:
573.893
SMILES:
Cc1cnn(Cc2ccc(Cn3cc(C(=O)NCc4c(F)c(Cl)ccc4C(F)(F)F)c(n3)C(F)(F)F)cc2)c1
: