Target
Plasma kallikrein
Ligand
BDBM408756
Substrate
Meas. Tech.
Inhibitory Activity In Vitro Assay
IC50
6610±n/a nM
Citation
 Davie, RLEdwards, HJEvans, DMHodgson, ST N-((het) arylmethyl)-heteroaryl-carboxamides compounds as plasma kallikrein inhibitors US Patent  US10364238 Publication Date 7/30/2019 
Target
Name:
Plasma kallikrein
Synonyms:
Fletcher factor KLKB1 Kallikrein Plasma kallikrein heavy chain Plasma prekallikrein
Type:
Protein
Mol. Mass.:
71391.16
Organism:
Homo sapiens (Human)
Description:
P03952
Residue:
638
  
Inhibitor
Name:
BDBM408756
Synonyms:
N-[(2-fluoro-3-methoxyphenyl)methyl]-3-(N-methylacetamido)-1-({4-[(2-oxopyridin- 1-yl)methyl]phenyl}methyl)pyrazole-4-carboxamide US11001578, Example 72 US11198691, Example 72
Type:
Small organic molecule
Emp. Form.:
C28H28FN5O4
Mol. Mass.:
517.5514
SMILES:
COc1cccc(CNC(=O)c2cn(Cc3ccc(Cn4ccccc4=O)cc3)nc2N(C)C(C)=O)c1F
: