Target
Plasma kallikrein
Ligand
BDBM408797
Substrate
Meas. Tech.
Inhibitory Activity In Vitro Assay
IC50
140±n/a nM
Citation
 Davie, RLEdwards, HJEvans, DMHodgson, ST N-((het) arylmethyl)-heteroaryl-carboxamides compounds as plasma kallikrein inhibitors US Patent  US10364238 Publication Date 7/30/2019 
Target
Name:
Plasma kallikrein
Synonyms:
Fletcher factor KLKB1 Kallikrein Plasma kallikrein heavy chain Plasma prekallikrein
Type:
Protein
Mol. Mass.:
71391.16
Organism:
Homo sapiens (Human)
Description:
P03952
Residue:
638
  
Inhibitor
Name:
BDBM408797
Synonyms:
N-[(2,6-difluoro-3-methoxyphenyl)methyl]-3-(methoxymethyl)-1-({4-[(4-methyl-2- oxopyridin-1-yl)methyl]phenyl}methyl)pyrazole-4-carboxamide US11001578, Example 106 US11198691, Example 106
Type:
Small organic molecule
Emp. Form.:
C28H28F2N4O4
Mol. Mass.:
522.5431
SMILES:
COCc1nn(Cc2ccc(Cn3ccc(C)cc3=O)cc2)cc1C(=O)NCc1c(F)ccc(OC)c1F
: