Target
Bifunctional epoxide hydrolase 2
Ligand
BDBM409029
Substrate
Meas. Tech.
FRET-displacement assay
Ki
3.14±0.70 nM
Citation
 Hammock, BDLee, KSInceoglu, AB Potent soluble epdxide hydrolase inhibitors US Patent  US10377744 Publication Date 8/13/2019 
Target
Name:
Bifunctional epoxide hydrolase 2
Synonyms:
Cytosolic epoxide hydrolase 2 EPHX2 HYES_HUMAN Soluble epoxide hydrolase (sEH) | epoxide hydrolase 2, cytoplasmic
Type:
Enzyme
Mol. Mass.:
62613.07
Organism:
Homo sapiens (Human)
Description:
P34913
Residue:
555
  
Inhibitor
Name:
BDBM409029
Synonyms:
US10377744, Compound No. 49 US11723929, Compound 49
Type:
Small organic molecule
Emp. Form.:
C19H24F4N2O3
Mol. Mass.:
404.3991
SMILES:
CC[C@H](C)C(=O)N1CCC(CC(=O)Nc2ccc(OC(F)(F)F)c(F)c2)CC1
: