Target
cAMP and cAMP-inhibited cGMP 3',5'-cyclic phosphodiesterase 10A
Ligand
BDBM294484
Substrate
Meas. Tech.
Inhibition Assay
Temperature
298.15±n/a K
IC50
195±n/a nM
Comments
extracted
Citation
 Flohr, A Imidazole derivatives US Patent  US9586970 Publication Date 3/7/2017 
Target
Name:
cAMP and cAMP-inhibited cGMP 3',5'-cyclic phosphodiesterase 10A
Synonyms:
3',5'-cyclic phosphodiesterase PDE10A Phosphodiesterase 10 (PDE10) | Phosphodiesterase 10A
Type:
Protein
Mol. Mass.:
88412.52
Organism:
Homo sapiens (Human)
Description:
Q9Y233
Residue:
1055
  
Inhibitor
Name:
BDBM294484
Synonyms:
1-(2-(2-(5,8-dimethyl-[1,2,4]triazolo[1,5-a]pyrazin-2-yl)ethyl)-1-methyl-1H-imidazol-4-yl)pyridin-2(1H)-one US9586970, 5
Type:
Small organic molecule
Emp. Form.:
C18H19N7O
Mol. Mass.:
349.3898
SMILES:
Cc1cnc(C)c2nc(CCc3nc(cn3C)-n3ccccc3=O)nn12
: