Target
cAMP and cAMP-inhibited cGMP 3',5'-cyclic phosphodiesterase 10A
Ligand
BDBM294497
Substrate
Meas. Tech.
Inhibition Assay
Temperature
298.15±n/a K
IC50
168±n/a nM
Comments
extracted
Citation
 Flohr, A Imidazole derivatives US Patent  US9586970 Publication Date 3/7/2017 
Target
Name:
cAMP and cAMP-inhibited cGMP 3',5'-cyclic phosphodiesterase 10A
Synonyms:
3',5'-cyclic phosphodiesterase PDE10A Phosphodiesterase 10 (PDE10) | Phosphodiesterase 10A
Type:
Protein
Mol. Mass.:
88412.52
Organism:
Homo sapiens (Human)
Description:
Q9Y233
Residue:
1055
  
Inhibitor
Name:
BDBM294497
Synonyms:
1-[2-(2-{5,8-dimethyl-[1,2,4]triazolo[1,5-c]pyrimidin-2-yl}ethyl)-1-(2,2,2-trifluoroethyl)-1H-imidazol-4-yl]pyrrolidin-2-one | US9586970, 18
Type:
Small organic molecule
Emp. Form.:
C18H20F3N7O
Mol. Mass.:
407.3929
SMILES:
Cc1cnc(C)n2nc(CCc3nc(cn3CC(F)(F)F)N3CCCC3=O)nc12
: