Target
cAMP and cAMP-inhibited cGMP 3',5'-cyclic phosphodiesterase 10A
Ligand
BDBM294498
Substrate
Meas. Tech.
Inhibition Assay
Temperature
298.15±n/a K
IC50
26.8±n/a nM
Comments
extracted
Citation
 Flohr, A Imidazole derivatives US Patent  US9586970 Publication Date 3/7/2017 
Target
Name:
cAMP and cAMP-inhibited cGMP 3',5'-cyclic phosphodiesterase 10A
Synonyms:
3',5'-cyclic phosphodiesterase PDE10A Phosphodiesterase 10 (PDE10) | Phosphodiesterase 10A
Type:
Protein
Mol. Mass.:
88412.52
Organism:
Homo sapiens (Human)
Description:
Q9Y233
Residue:
1055
  
Inhibitor
Name:
BDBM294498
Synonyms:
1-[1-(2,2-difluoroethyl)-2-(2-{5,8-dimethyl-[1,2,4]triazolo[1,5-c]pyrimidin-2-yl}ethyl)-1H-imidazol-4-yl]pyrrolidin-2-one | US9586970, 19
Type:
Small organic molecule
Emp. Form.:
C18H21F2N7O
Mol. Mass.:
389.4024
SMILES:
Cc1cnc(C)n2nc(CCc3nc(cn3CC(F)F)N3CCCC3=O)nc12
: