Target
cAMP and cAMP-inhibited cGMP 3',5'-cyclic phosphodiesterase 10A
Ligand
BDBM294503
Substrate
Meas. Tech.
Inhibition Assay
Temperature
298.15±n/a K
IC50
75.5±n/a nM
Comments
extracted
Citation
 Flohr, A Imidazole derivatives US Patent  US9586970 Publication Date 3/7/2017 
Target
Name:
cAMP and cAMP-inhibited cGMP 3',5'-cyclic phosphodiesterase 10A
Synonyms:
3',5'-cyclic phosphodiesterase PDE10A Phosphodiesterase 10 (PDE10) | Phosphodiesterase 10A
Type:
Protein
Mol. Mass.:
88412.52
Organism:
Homo sapiens (Human)
Description:
Q9Y233
Residue:
1055
  
Inhibitor
Name:
BDBM294503
Synonyms:
1-(1-Methyl-2-{2-[3-methyl-2-(trifluoromethyl) imidazo[1,2-b]pyridazin-6-yl]ethynyl}-1H-imidazol-4-yl)pyrrolidin-2-one | US9586970, 24
Type:
Small organic molecule
Emp. Form.:
C18H15F3N6O
Mol. Mass.:
388.3465
SMILES:
Cc1c(nc2ccc(nn12)C#Cc1nc(cn1C)N1CCCC1=O)C(F)(F)F
: