Target
Epoxide hydrolase 1
Ligand
BDBM25738
Substrate
Meas. Tech.
Inhibition Assay
IC50
86.0±n/a nM
Citation
 Guedes, AGHammock, BDMorisseau, C Treatment of inflammatory disorders in non-human mammals US Patent  US10383835 Publication Date 8/20/2019 
Target
Name:
Epoxide hydrolase 1
Synonyms:
EPHX1 | Soluble Epoxide Hydrolase
Type:
Mol. Mass.:
55234.30
Organism:
Canis lupus familiaris (Dog) (Canis familiaris)
Description:
A0A8I3N2D1
Residue:
479
  
Inhibitor
Name:
BDBM25738
Synonyms:
1-adamantan-1-yl-3-{5-[2-(2-ethoxyethoxy)ethoxy]pentyl}urea US10383835, Compound 950 | Urea-based compound, 19
Type:
Small organic molecule
Emp. Form.:
C22H40N2O4
Mol. Mass.:
396.564
SMILES:
CCOCCOCCOCCCCCNC(=O)NC12CC3CC(CC(C3)C1)C2
: