Target
Epoxide hydrolase
Ligand
BDBM25739
Substrate
Meas. Tech.
Inhibition Assay
IC50
5.00±n/a nM
Citation
 Guedes, AGHammock, BDMorisseau, C Treatment of inflammatory disorders in non-human mammals US Patent  US10383835 Publication Date 8/20/2019 
Target
Name:
Epoxide hydrolase
Synonyms:
EPHX1
Type:
Enzyme
Mol. Mass.:
52112.47
Organism:
Ovis aries (Sheep)
Description:
W5Q7Q6
Residue:
451
  
Inhibitor
Name:
BDBM25739
Synonyms:
4-({4-[(adamantan-1-ylcarbamoyl)amino]cyclohexyl}oxy)benzoic acid Urea-based compound, 20 | Urea-based compound, 21
Type:
Small organic molecule
Emp. Form.:
C24H32N2O4
Mol. Mass.:
412.5219
SMILES:
OC(=O)c1ccc(OC2CCC(CC2)NC(=O)NC23CC4CC(CC(C4)C2)C3)cc1
: