Target
High affinity nerve growth factor receptor
Ligand
BDBM412325
Substrate
Meas. Tech.
Evaluation of Binding Activity for Human TrkA Protein
IC50
<50±n/a nM
Citation
 Saitoh, FNagasue, H Tetrahydronaphthyl urea derivative US Patent  US10399945 Publication Date 9/3/2019 
Target
Name:
High affinity nerve growth factor receptor
Synonyms:
2.7.10.1 NTRK1 NTRK1_HUMAN Neurotrophic tyrosine kinase receptor type 1 Synonyms=MTC TRK1-transforming tyrosine kinase protein TRKA GN Trk-A Tropomyosin-related kinase A Tyrosine kinase receptor Tyrosine kinase receptor A Tyrosine kinase receptor A (Trk-A) gp140trk | p140-TrkA
Type:
Mol. Mass.:
87498.18
Organism:
Homo sapiens (Human)
Description:
P04629
Residue:
796
  
Inhibitor
Name:
BDBM412325
Synonyms:
US10399945, Example 54 | US10927079, Compound 54
Type:
Small organic molecule
Emp. Form.:
C32H33F2N5O3
Mol. Mass.:
573.6329
SMILES:
Cc1cc(NC(=O)N[C@H]2[C@H](O)CC(C)(C)c3cc(F)c(F)cc23)c(nc1-c1cnc(nc1)C(C)(C)O)-c1ccccc1
: