Target
Hsp90 co-chaperone Cdc37
Ligand
BDBM279658
Substrate
Meas. Tech.
In Vitro Assay
IC50
550±n/a nM
Citation
 Cai, XQian, CZhai, H Fused amino pyridine as HSP90 inhibitors US Patent  US10428068 Publication Date 10/1/2019 
Target
Name:
Hsp90 co-chaperone Cdc37
Synonyms:
CDC37 CDC37_HUMAN | Hsp90 co-chaperone
Type:
Molecular Chaperone
Mol. Mass.:
44453.72
Organism:
Homo sapiens (Human)
Description:
Q16543
Residue:
378
  
Inhibitor
Name:
BDBM279658
Synonyms:
US10035797, Compound 2 US10844056, Compound 2 US9630965, Compound 2
Type:
Small organic molecule
Emp. Form.:
C18H15ClN4O2S
Mol. Mass.:
386.855
SMILES:
Nc1nccc2n(CCCC#C)c(Sc3cc4OCOc4cc3Cl)nc12
: