Target
Heat shock protein HSP 90-alpha
Ligand
BDBM279689
Substrate
Meas. Tech.
Competition Binding (Fluorescence Polarization) Assay
IC50
5500±n/a nM
Citation
 Cai, XQian, CZhai, H Fused amino pyridine as HSP90 inhibitors US Patent  US10428068 Publication Date 10/1/2019 
Target
Name:
Heat shock protein HSP 90-alpha
Synonyms:
HS90A_HUMAN HSP86 HSP90AA1 HSPCA Heat shock 86 kDa Heat shock protein HSP 90-alpha (HSP90) LAP-2 Lipopolysaccharide-associated protein 2 heat shock protein 90kDa alpha (cytosolic), class A member 1 isoform 2
Type:
Molecular Chaperone
Mol. Mass.:
84623.45
Organism:
Homo sapiens (Human)
Description:
P07900
Residue:
732
  
Inhibitor
Name:
BDBM279689
Synonyms:
US10035797, Compound 27 US10844056, Compound 27 US9630965, Compound 27
Type:
Small organic molecule
Emp. Form.:
C17H14BrN5O2S
Mol. Mass.:
432.294
SMILES:
Nc1nccc2n(CCCC#N)c(Sc3cc4OCOc4cc3Br)nc12
: