Target
Heat shock protein HSP 90-alpha
Ligand
BDBM279703
Substrate
Meas. Tech.
Competition Binding (Fluorescence Polarization) Assay
IC50
5500±n/a nM
Citation
 Cai, XQian, CZhai, H Fused amino pyridine as HSP90 inhibitors US Patent  US10428068 Publication Date 10/1/2019 
Target
Name:
Heat shock protein HSP 90-alpha
Synonyms:
HS90A_HUMAN HSP86 HSP90AA1 HSPCA Heat shock 86 kDa Heat shock protein HSP 90-alpha (HSP90) LAP-2 Lipopolysaccharide-associated protein 2 heat shock protein 90kDa alpha (cytosolic), class A member 1 isoform 2
Type:
Molecular Chaperone
Mol. Mass.:
84623.45
Organism:
Homo sapiens (Human)
Description:
P07900
Residue:
732
  
Inhibitor
Name:
BDBM279703
Synonyms:
US10035797, Compound 51 US10428068, Compound 51 US11560377, Compound 51 | US9630965, Compound 51
Type:
Small organic molecule
Emp. Form.:
C19H22BrN5O2S
Mol. Mass.:
464.379
SMILES:
CC(C)NCCCn1c(Sc2cc3OCOc3cc2Br)nc2c(N)nccc12
: