Target
Heat shock protein HSP 90-alpha
Ligand
BDBM50439622
Substrate
Meas. Tech.
Competition Binding (Fluorescence Polarization) Assay
IC50
<100±n/a nM
Citation
 Cai, XQian, CZhai, H Fused amino pyridine as HSP90 inhibitors US Patent  US10428068 Publication Date 10/1/2019 
Target
Name:
Heat shock protein HSP 90-alpha
Synonyms:
HS90A_HUMAN HSP86 HSP90AA1 HSPCA Heat shock 86 kDa Heat shock protein HSP 90-alpha (HSP90) LAP-2 Lipopolysaccharide-associated protein 2 heat shock protein 90kDa alpha (cytosolic), class A member 1 isoform 2
Type:
Molecular Chaperone
Mol. Mass.:
84623.45
Organism:
Homo sapiens (Human)
Description:
P07900
Residue:
732
  
Inhibitor
Name:
BDBM50439622
Synonyms:
CHEMBL2419346 US10428068, Compound 111 US11560377, Compound 111 | US9630965, Compound 111
Type:
Small organic molecule
Emp. Form.:
C22H30N6O2S
Mol. Mass.:
442.578
SMILES:
CN(C)c1cc2OCOc2cc1Sc1nc2c(N)nccc2n1CCNCC(C)(C)C
: