Target
Heat shock protein HSP 90-alpha
Ligand
BDBM279729
Substrate
Meas. Tech.
Competition Binding (Fluorescence Polarization) Assay
IC50
550±n/a nM
Citation
 Cai, XQian, CZhai, H Fused amino pyridine as HSP90 inhibitors US Patent  US10428068 Publication Date 10/1/2019 
Target
Name:
Heat shock protein HSP 90-alpha
Synonyms:
HS90A_HUMAN HSP86 HSP90AA1 HSPCA Heat shock 86 kDa Heat shock protein HSP 90-alpha (HSP90) LAP-2 Lipopolysaccharide-associated protein 2 heat shock protein 90kDa alpha (cytosolic), class A member 1 isoform 2
Type:
Molecular Chaperone
Mol. Mass.:
84623.45
Organism:
Homo sapiens (Human)
Description:
P07900
Residue:
732
  
Inhibitor
Name:
BDBM279729
Synonyms:
US10035797, Compound 113 US10844056, Compound 113 US9630965, Compound 113
Type:
Small organic molecule
Emp. Form.:
C20H24N6O4S
Mol. Mass.:
444.507
SMILES:
CC(C)(C)CNCCn1c(Sc2cc3OCOc3cc2[N+]([O-])=O)nc2c(N)nccc12
: