Target
Cannabinoid receptor 2
Ligand
BDBM295696
Substrate
Meas. Tech.
CB2 cAMP (Assay 1)
EC50
0.230±n/a nM
Citation
 Riether, DBinder, FPDoods, HMueller, SGNicholson, JRSauer, A (Cyano-dimethyl-methyl)-isoxazoles and -[1,3,4]thiadiazoles US Patent  US10112934 Publication Date 10/30/2018 
Target
Name:
Cannabinoid receptor 2
Synonyms:
CANNABINOID CB2 CB2 CB2B CNR2_HUMAN Cannabinoid CB2 receptor Cannabinoid receptor 2 (CB2R) | hCB2
Type:
G Protein-Coupled Receptor (GPCR)
Mol. Mass.:
39690.94
Organism:
Homo sapiens (Human)
Description:
P34972
Residue:
360
  
Inhibitor
Name:
BDBM295696
Synonyms:
US10112934, Example 5 US11084810, Example 5 | US11725004, Example 5
Type:
Small organic molecule
Emp. Form.:
C18H29N5O4S
Mol. Mass.:
411.519
SMILES:
CN(C1CCN(CC1)S(C)(=O)=O)C(C)(C)C(=O)Nc1cc(no1)C(C)(C)C#N
: