Target
P2X purinoceptor 7
Ligand
BDBM254381
Substrate
Meas. Tech.
Ca2+ flux assay
pH
7.4±n/a
IC50
6.30±n/a nM
Comments
extracted
Citation
 Alcazar Vaca, MJAllison, BDAndres Gil, JIChrovian, CCCoate, HRDe Angelis, MDeng, XDvorak, CAGelin, CFLetavic, MALiang, JTMani, NSRech, JCSavall, BMSoyode-Johnson, AStenne, BMSwanson, DMWall, JL P2X7 modulators and methods of use US Patent  US10112937 Publication Date 10/30/2018 
Target
Name:
P2X purinoceptor 7
Synonyms:
ATP receptor P2X purinoceptor 7 P2X purinoceptor 7 (P2X7) P2X7 rat P2rx7 | Purinergic receptor
Type:
Protein
Mol. Mass.:
68403.50
Organism:
Rattus norvegicus (Rat)
Description:
Q64663
Residue:
595
  
Inhibitor
Name:
BDBM254381
Synonyms:
US10112937, Example 288 US10703749, Example 288 | US9464084, 288
Type:
Small organic molecule
Emp. Form.:
C20H16ClF3N4O
Mol. Mass.:
420.815
SMILES:
C[C@H]1Cc2c(CN1C(=O)c1cccc(c1Cl)C(F)(F)F)nnn2-c1ccccc1
: