Target
Voltage-dependent N-type calcium channel subunit alpha-1B
Ligand
BDBM164209
Substrate
Meas. Tech.
High-Throughput Cav2.2/Kir2.3 T-Type Fluorescent Assay
IC50
1130±n/a nM
Citation
 PubChem, PCPajouhesh, HHolland, RZhang, LPajouhesh, HLamontagne, JWhelan, B Benzimidazole inhibitors of the sodium channel US Patent  US9688615 Publication Date 6/27/2017 
Target
Name:
Voltage-dependent N-type calcium channel subunit alpha-1B
Synonyms:
BIII CAC1B_HUMAN CACNA1B Calcium channel (Type N) Voltage-dependent N-type calcium channel subunit alpha-1B Voltage-gated N-type calcium channel alpha-1B subunit Voltage-gated calcium channel Voltage-gated calcium channel subunit alpha Cav2.2 ((alpha 1B, beta 1b, alpha 2 delta-1) | calcium channel, voltage-dependent, N type, alpha 1B subunit
Type:
Enzyme
Mol. Mass.:
262548.16
Organism:
Homo sapiens (Human)
Description:
Q00975
Residue:
2339
  
Inhibitor
Name:
BDBM164209
Synonyms:
US9688615, 20
Type:
Small organic molecule
Emp. Form.:
C20H22F6N4O
Mol. Mass.:
448.4053
SMILES:
CC1(CCC1)NC(=O)CN1CC(Cc2nc3c(cc(cc3[nH]2)C(F)(F)F)C(F)(F)F)C1
: