Target
Voltage-dependent T-type calcium channel subunit alpha-1G
Ligand
BDBM163549
Substrate
Meas. Tech.
High-Throughput Cav3.1 T-Type Fluorescent Assay
IC50
900±n/a nM
Citation
 PubChem, PCPajouhesh, HHolland, RZhang, LPajouhesh, HLamontagne, JWhelan, B Benzimidazole inhibitors of the sodium channel US Patent  US9688615 Publication Date 6/27/2017 
Target
Name:
Voltage-dependent T-type calcium channel subunit alpha-1G
Synonyms:
CAC1G_HUMAN KIAA1123 Voltage-gated T-type calcium channel alpha-1G subunit
Type:
PROTEIN
Mol. Mass.:
262471.14
Organism:
Homo sapiens (Human)
Description:
ChEMBL_1515216
Residue:
2377
  
Inhibitor
Name:
BDBM163549
Synonyms:
US9688615, 3
Type:
Small organic molecule
Emp. Form.:
C19H22F6N4O
Mol. Mass.:
436.3946
SMILES:
CC(C)(C)NC(=O)Cn1c(CC2CNC2)nc2c(cc(cc12)C(F)(F)F)C(F)(F)F
: