Target
Voltage-dependent T-type calcium channel subunit alpha-1G
Ligand
BDBM164199
Substrate
Meas. Tech.
High-Throughput Cav3.1 T-Type Fluorescent Assay
IC50
150±n/a nM
Citation
 PubChem, PCPajouhesh, HHolland, RZhang, LPajouhesh, HLamontagne, JWhelan, B Benzimidazole inhibitors of the sodium channel US Patent  US9688615 Publication Date 6/27/2017 
Target
Name:
Voltage-dependent T-type calcium channel subunit alpha-1G
Synonyms:
CAC1G_HUMAN KIAA1123 Voltage-gated T-type calcium channel alpha-1G subunit
Type:
PROTEIN
Mol. Mass.:
262471.14
Organism:
Homo sapiens (Human)
Description:
ChEMBL_1515216
Residue:
2377
  
Inhibitor
Name:
BDBM164199
Synonyms:
US9688615, 10
Type:
Small organic molecule
Emp. Form.:
C13H11F6N3
Mol. Mass.:
323.237
SMILES:
FC(F)(F)c1cc2nc(CC3CNC3)[nH]c2cc1C(F)(F)F
: