Target
Voltage-dependent T-type calcium channel subunit alpha-1G
Ligand
BDBM164262
Substrate
Meas. Tech.
High-Throughput Cav3.1 T-Type Fluorescent Assay
IC50
890±n/a nM
Citation
 PubChem, PCPajouhesh, HHolland, RZhang, LPajouhesh, HLamontagne, JWhelan, B Benzimidazole inhibitors of the sodium channel US Patent  US9688615 Publication Date 6/27/2017 
Target
Name:
Voltage-dependent T-type calcium channel subunit alpha-1G
Synonyms:
CAC1G_HUMAN KIAA1123 Voltage-gated T-type calcium channel alpha-1G subunit
Type:
PROTEIN
Mol. Mass.:
262471.14
Organism:
Homo sapiens (Human)
Description:
ChEMBL_1515216
Residue:
2377
  
Inhibitor
Name:
BDBM164262
Synonyms:
US9688615, 73
Type:
Small organic molecule
Emp. Form.:
C18H22F6N4O
Mol. Mass.:
424.3839
SMILES:
CC(C)C[C@H](CN)CC(=O)NCc1nc2cc(cc(c2[nH]1)C(F)(F)F)C(F)(F)F
: