Target
Voltage-dependent T-type calcium channel subunit alpha-1G
Ligand
BDBM164360
Substrate
Meas. Tech.
High-Throughput Cav3.1 T-Type Fluorescent Assay
IC50
3080±n/a nM
Citation
 PubChem, PCPajouhesh, HHolland, RZhang, LPajouhesh, HLamontagne, JWhelan, B Benzimidazole inhibitors of the sodium channel US Patent  US9688615 Publication Date 6/27/2017 
Target
Name:
Voltage-dependent T-type calcium channel subunit alpha-1G
Synonyms:
CAC1G_HUMAN KIAA1123 Voltage-gated T-type calcium channel alpha-1G subunit
Type:
PROTEIN
Mol. Mass.:
262471.14
Organism:
Homo sapiens (Human)
Description:
ChEMBL_1515216
Residue:
2377
  
Inhibitor
Name:
BDBM164360
Synonyms:
US9688615, 171
Type:
Small organic molecule
Emp. Form.:
C16H17F6N3
Mol. Mass.:
365.3167
SMILES:
NC1(Cc2nc3cc(cc(c3[nH]2)C(F)(F)F)C(F)(F)F)CCCCC1
: