Target
Voltage-dependent T-type calcium channel subunit alpha-1H
Ligand
BDBM164237
Substrate
Meas. Tech.
High-Throughput Cav3.1 T-Type Fluorescent Assay
IC50
3800±n/a nM
Citation
 PubChem, PCPajouhesh, HHolland, RZhang, LPajouhesh, HLamontagne, JWhelan, B Benzimidazole inhibitors of the sodium channel US Patent  US9688615 Publication Date 6/27/2017 
Target
Name:
Voltage-dependent T-type calcium channel subunit alpha-1H
Synonyms:
CAC1H_HUMAN Low-voltage-activated calcium channel alpha1 3.2 subunit Voltage-gated calcium channel voltage-dependent T-type calcium channel subunit alpha-1H isoform a
Type:
Enzyme Catalytic Domain
Mol. Mass.:
259187.68
Organism:
Homo sapiens (Human)
Description:
Calcium channel (Type T,L) 0 0::O95180
Residue:
2353
  
Inhibitor
Name:
BDBM164237
Synonyms:
US9688615, 48
Type:
Small organic molecule
Emp. Form.:
C17H20F6N4O
Mol. Mass.:
410.3573
SMILES:
CN(Cc1nc2cc(cc(c2[nH]1)C(F)(F)F)C(F)(F)F)C(=O)CNC(C)(C)C
: