Target
Voltage-dependent L-type calcium channel subunit alpha-1C
Ligand
BDBM164208
Substrate
Meas. Tech.
Nav1.5 Assay
pH
7.4±n/a
IC50
3560±n/a nM
Comments
extracted
Citation
 PubChem, PCPajouhesh, HHolland, RZhang, LPajouhesh, HLamontagne, JWhelan, B Benzimidazole inhibitors of the sodium channel US Patent  US9688615 Publication Date 6/27/2017 
Target
Name:
Voltage-dependent L-type calcium channel subunit alpha-1C
Synonyms:
CAC1C_HUMAN CACN2 CACNL1A1 Calcium channel (Type L) L-type calcium channel alpha-1c/beta-2/alpha2delta-1 Voltage-gated L-type calcium channel Voltage-gated calcium channel | Voltage-gated calcium channel subunit alpha Cav1.2
Type:
Enzyme Catalytic Domain
Mol. Mass.:
248979.79
Organism:
Homo sapiens (Human)
Description:
Calcium channel (Type L) 0 HUMAN::Q13936
Residue:
2221
  
Inhibitor
Name:
BDBM164208
Synonyms:
US9688615, 19
Type:
Small organic molecule
Emp. Form.:
C19H22F6N4O
Mol. Mass.:
436.3946
SMILES:
CC(C)(C)NC(=O)CN1CC(Cc2nc3c(cc(cc3[nH]2)C(F)(F)F)C(F)(F)F)C1
: