Target
Voltage-dependent L-type calcium channel subunit alpha-1C
Ligand
BDBM164220
Substrate
Meas. Tech.
Nav1.5 Assay
pH
7.4±n/a
IC50
2990±n/a nM
Comments
extracted
Citation
 PubChem, PCPajouhesh, HHolland, RZhang, LPajouhesh, HLamontagne, JWhelan, B Benzimidazole inhibitors of the sodium channel US Patent  US9688615 Publication Date 6/27/2017 
Target
Name:
Voltage-dependent L-type calcium channel subunit alpha-1C
Synonyms:
CAC1C_HUMAN CACN2 CACNL1A1 Calcium channel (Type L) L-type calcium channel alpha-1c/beta-2/alpha2delta-1 Voltage-gated L-type calcium channel Voltage-gated calcium channel | Voltage-gated calcium channel subunit alpha Cav1.2
Type:
Enzyme Catalytic Domain
Mol. Mass.:
248979.79
Organism:
Homo sapiens (Human)
Description:
Calcium channel (Type L) 0 HUMAN::Q13936
Residue:
2221
  
Inhibitor
Name:
BDBM164220
Synonyms:
US9688615, 31
Type:
Small organic molecule
Emp. Form.:
C16H19F6N3
Mol. Mass.:
367.3326
SMILES:
CC(C)C[C@H](CN)Cc1nc2c(cc(cc2[nH]1)C(F)(F)F)C(F)(F)F
: