Target
Toll-like receptor 7
Ligand
BDBM274079
Substrate
Meas. Tech.
Biological Assay
IC50
0.200±n/a nM
Citation
 Dyckman, AJDodd, DSMussari, CPPasunoori, LKumar, SR [1,2,4]triazolo[1,5-a]pyridinyl substituted indole compounds US Patent  US10478424 Publication Date 11/19/2019 
Target
Name:
Toll-like receptor 7
Synonyms:
ORF Names:UNQ248/PRO285 TLR7_HUMAN | Toll-like receptor 7 (TLR7)
Type:
Enzyme
Mol. Mass.:
120945.35
Organism:
Homo sapiens (Human)
Description:
Q9NYK1
Residue:
1049
  
Inhibitor
Name:
BDBM274079
Synonyms:
US10071079, Example 865 | US10478424, Example 865
Type:
Small organic molecule
Emp. Form.:
C28H32F2N6O2
Mol. Mass.:
522.5895
SMILES:
COc1cc(cn2ncnc12)-c1[nH]c2ccc(cc2c1C(C)C)C1CCN(CC(=O)N2CC(F)(F)C2)CC1
: