Target
Dual specificity protein kinase TTK
Ligand
BDBM241235
Substrate
Meas. Tech.
Inhibition Kinase Assay
IC50
5.00±n/a nM
Citation
 Hoelder, SBlagg, JSolanki, SWoodward, HNaud, SBavetsias, VSheldrake, PInnocenti, PCheung, KJAtrash, B Compounds that inhibit MPS1 kinase US Patent  US10479788 Publication Date 11/19/2019 
Target
Name:
Dual specificity protein kinase TTK
Synonyms:
Dual specificity protein kinase (TTK) MPS1 Monopolar Spindle 1 (MPS1) Monopolar Spindle 1 Kinase (MPS1) TTK | TTK_HUMAN
Type:
Protein
Mol. Mass.:
97086.79
Organism:
Homo sapiens (Human)
Description:
P33981
Residue:
857
  
Inhibitor
Name:
BDBM241235
Synonyms:
US10479788, Example 77 US9409907, 77
Type:
Small organic molecule
Emp. Form.:
C24H29N7O
Mol. Mass.:
431.5334
SMILES:
COc1cc(ccc1Nc1ncc2ccnc(N[C@@H](C)C(C)(C)C)c2n1)-c1cnn(C)c1
: