Target
Amine oxidase [flavin-containing] B
Ligand
BDBM153684
Substrate
Meas. Tech.
MAO-A and MAO-B Assays
IC50
>130000±n/a nM
Citation
 Cannizzaro, CEGraupe, MGuerrero, JALu, YStrickley, RGVenkataramani, CZablocki, J Compounds for the treatment of addiction US Patent  US10507215 Publication Date 12/17/2019 
Target
Name:
Amine oxidase [flavin-containing] B
Synonyms:
AOFB_HUMAN MAOB Monoamine oxidase type B (MAO B) Monoamine oxidase type B (MAOB)
Type:
Protein
Mol. Mass.:
58768.76
Organism:
Homo sapiens (Human)
Description:
P27338
Residue:
520
  
Inhibitor
Name:
BDBM153684
Synonyms:
US10507215, Compound 1 US9610299, Example 1
Type:
Small organic molecule
Emp. Form.:
C22H20Cl2N2O4
Mol. Mass.:
447.311
SMILES:
COCCOc1cc(Cl)c(C(=O)NCc2ccc(cc2)-c2cc[nH]c(=O)c2)c(Cl)c1
: