Target
Aldehyde dehydrogenase, mitochondrial
Ligand
BDBM153689
Substrate
Meas. Tech.
ALDH2 Assay
IC50
1113±n/a nM
Citation
 Cannizzaro, CEGraupe, MGuerrero, JALu, YStrickley, RGVenkataramani, CZablocki, J Compounds for the treatment of addiction US Patent  US10507215 Publication Date 12/17/2019 
Target
Name:
Aldehyde dehydrogenase, mitochondrial
Synonyms:
ALDH class 2 ALDH2 ALDHI Aldehyde dehydrogenase (ALDH2)
Type:
Enzyme
Mol. Mass.:
56382.67
Organism:
Homo sapiens (Human)
Description:
P05091
Residue:
517
  
Inhibitor
Name:
BDBM153689
Synonyms:
US10507215, Compound 6 | US9000015, 6
Type:
Small organic molecule
Emp. Form.:
C20H16Cl2N2O2
Mol. Mass.:
387.259
SMILES:
Cc1cc(cc(=O)[nH]1)-c1ccc(CNC(=O)c2c(Cl)cccc2Cl)cc1
: