Target
Amine oxidase [flavin-containing] B
Ligand
BDBM153689
Substrate
Meas. Tech.
MAO-A and MAO-B Assays
IC50
>130000±n/a nM
Citation
 Cannizzaro, CEGraupe, MGuerrero, JALu, YStrickley, RGVenkataramani, CZablocki, J Compounds for the treatment of addiction US Patent  US10507215 Publication Date 12/17/2019 
Target
Name:
Amine oxidase [flavin-containing] B
Synonyms:
AOFB_HUMAN MAOB Monoamine oxidase type B (MAO B) Monoamine oxidase type B (MAOB)
Type:
Protein
Mol. Mass.:
58768.76
Organism:
Homo sapiens (Human)
Description:
P27338
Residue:
520
  
Inhibitor
Name:
BDBM153689
Synonyms:
US10507215, Compound 6 | US9000015, 6
Type:
Small organic molecule
Emp. Form.:
C20H16Cl2N2O2
Mol. Mass.:
387.259
SMILES:
Cc1cc(cc(=O)[nH]1)-c1ccc(CNC(=O)c2c(Cl)cccc2Cl)cc1
: